{"text_format":"1","workbook":"xlsx","n_sheets":11,"sheets":["Page 1","Page 2","Page 3","Page 4","Page 5","Page 6","Page 7","Page 8","Page 9","Page 10","Sheet1"],"not_rendered":{"charts":0,"images":2,"macros":1,"external_links":3,"defined_names":24,"comments":0,"pivot_tables":0},"unopened":[],"bounds":{"document_bytes":16777216,"sheet_cells":100000,"rows_first":2000,"rows_last":500,"rows_between":2000,"halvings":0,"cell_chars":16384,"cell_head_chars":4096},"cells_cut":0,"cells_raw":0,"read":"whole","date_system":"1900"}

{"sheet":"Page 1","index":0,"n_rows":33,"n_cols":5,"rows_kept":33,"cut":false,"hidden":false,"merged":[[20,1,20,16],[22,1,22,16],[24,1,24,16],[25,1,25,16],[27,1,27,2]]}
[]
[]
[]
[]
[]
[]
[]
[]
[]
[]
{"$rows_left_out":24}
{"sheet":"Page 2","index":1,"n_rows":32,"n_cols":7,"rows_kept":32,"cut":false,"hidden":false,"merged":[[6,1,13,1],[6,2,13,2],[6,3,13,3],[6,4,13,4],[18,1,19,1],[18,2,19,2],[18,3,19,3],[18,4,19,4],[20,1,22,1],[20,2,22,2],[20,3,22,3],[20,4,22,4],[24,1,25,1],[24,2,25,2],[24,3,25,3],[24,4,25,4],[26,1,27,1],[26,2,27,2],[26,3,27,3],[26,4,27,4],[31,1,32,6]]}
[null,"MAIN PARTIES TO THE STRUCTURE, RATINGS AND TRIGGERS (IF APPLICABLE)"]
[]
[null,"Role","Counterparty","Fitch/Moody's/S&P Long Term Rating ","Fitch/Moody's/S&P Short Term Rating ","Applicable Trigger (loss of)","Consequence"]
[null,"Issuer","Holmes Master Issuer"]
[null,"Funding","Holmes Funding Limited"]
[null,"Mortgages Trustee ","Holmes Trustees Limited"]
[null,"Seller","Santander UK","A / Aa3 / A","F1 / P-1 / A-1","A3 (Moody's)","Funding required to establish a liquidity reserve fund."]
[null,null,null,null,null,"BBB / Baa2 / BBB","Seller to submit to the Mortgages Trustee, Funding, the Security Trustee and the Rating Agencies draft letters of notice to the Borrowers of sale and purchase of Loans."]
[null,null,null,null,null,"BBB- / Baa3 / BBB-","Completion of legal assignment of Loans to the Mortgages Trustee."]
[null,null,null,null,null,"F2 / P-2 / A-3","New Loans may not be assigned to the Mortgages Trustee."]
{"$rows_left_out":23}
{"sheet":"Page 3","index":2,"n_rows":69,"n_cols":14,"rows_kept":69,"cut":false,"hidden":false,"merged":[[24,1,24,2],[23,9,23,13],[47,1,47,5],[49,1,50,2]]}
[]
[null,"COLLATERAL REPORT"]
[]
[null,"Mortgage Loan Profile",null,null,null,null,null,null,null,"Trust Assets"]
[]
[null,"Original number of Mortgage Loans in Pool",null,null,null,115191,null,null,null,{"$f":"\"Current value of Mortgage Loans in Pool at\"&\" \"&TEXT(EOMONTH('Page 1'!E15,-1)+1,\"dd mmmm yyyy\")","v":"Current value of Mortgage Loans in Pool at 01 January 2018"},null,null,null,{"$f":"HLOOKUP(EOMONTH('Page 1'!E15,-1),'[3]Waterfall - Trustees'!$I$5:$DC$41,37,FALSE)","v":4299333067.1700001}]
[null,"Original current value of Mortgage Loans in Pool",null,null,null,6399214137.6800003,null,null,null,{"$f":"\"Last months Closing Trust Assets at\"&\" \"&TEXT(EOMONTH('Page 1'!E15,-2)+1,\"dd mmmm yyyy\")","v":"Last months Closing Trust Assets at 01 December 2017"},null,null,null,{"$f":"HLOOKUP(EOMONTH('Page 1'!E15,-2),'[3]Waterfall - Trustees'!$I$5:$DC$41,37,FALSE)","v":4384489319.6300001}]
[null,{"$f":"\"Current number of Mortgage Loans in Pool at\"&\" \"&TEXT('Page 1'!E15,\"dd-mmmm-yyyy\")","v":"Current number of Mortgage Loans in Pool at 31-January-2018"},null,null,null,{"$f":"D39","v":91387},null,null,null,{"$f":"\"Mortgage collections - Interest on\"&\" \"&TEXT(EOMONTH('Page 1'!E15,-1)+1,\"dd mmmmyyyy\")","v":"Mortgage collections - Interest on 01 January2018"},null,null,null,{"$f":"HLOOKUP(EOMONTH('Page 1'!E15,-1),'[3]Waterfall - Trustees'!$I$5:$DC$1048576,166,FALSE)","v":9807678.1999999993}]
[null,{"$f":"\"Current £ value of Mortgage Loans in Pool at\"&\" \"&TEXT('Page 1'!E15,\"dd-mmmm-yyyy\")","v":"Current £ value of Mortgage Loans in Pool at 31-January-2018"},null,null,null,{"$f":"E39","v":4435346115.8199997},null,null,null,{"$f":"\"Mortgage collections - Principal (Scheduled) on\"&\" \"&TEXT(EOMONTH('Page 1'!E15,-1)+1,\"dd mmmm yyyy\")","v":"Mortgage collections - Principal (Scheduled) on 01 January 2018"},null,null,null,{"$f":"+INDEX('[3]Waterfall - Trustees'!$263:$263,MATCH(EOMONTH('Page 1'!E17,-1),'[3]Waterfall - Trustees'!$5:$5,0))","v":31365130.259999275}]
[null,{"$f":"\"Weighted Average Yield on\"&\" \"&TEXT('Page 1'!E17,\"dd-mmmm-yyyy\")","v":"Weighted Average Yield on 08-January-2018"},null,null,null,{"$f":"INDEX('[3]Waterfall - Trustees'!$257:$257,MATCH(EOMONTH('Page 1'!E15,-1),'[3]Waterfall - Trustees'!$5:$5,0))","v":2.7175559870741495E-2},null,null,null,{"$f":"\"Mortgage collections - Principal (Unscheduled) on\"&\" \"&TEXT(EOMONTH('Page 1'!E15,-1)+1,\"dd mmmm yyyy\")","v":"Mortgage collections - Principal (Unscheduled) on 01 January 2018"},null,null,null,{"$f":"+('Page 8'!C21+'Page 8'!C24)-'Page 3'!N9","v":53828667.450000718}]
{"$rows_left_out":60}
{"sheet":"Page 4","index":3,"n_rows":63,"n_cols":14,"rows_kept":63,"cut":false,"hidden":false,"merged":[[1,8,3,8],[3,1,3,2],[4,1,4,2],[5,1,5,2],[6,1,6,2],[26,1,26,2],[45,1,45,6],[48,1,49,2],[9,8,10,10],[4,11,6,13],[12,8,13,8],[22,8,23,9],[7,11,8,13],[8,1,8,2]]}
[]
[null,"Product Breakdown",null,"Number","%","Current balance","%",null,{"$f":"\"Substitution, redemptions and repurchases during period \"&TEXT(EOMONTH('Page 1'!E15,-1)+1,\"dd mmmm yyyy\")&\"- \"&TEXT(EOMONTH('Page 1'!E15,0)+1,\"dd mmmm yyyy\")","v":"Substitution, redemptions and repurchases during period 01 January 2018- 01 February 2018"},"Number of accounts","Current balance"]
[null,"(By Balance)",null,"of accounts","by number","£","by balance",null,null,"this period","this period"]
[null,"Discounted SVR Loans",null,{"$f":"'[3]Trustee Assets NEW'!E2088","v":262},{"$f":"(D4/$D$9)*100","v":0.28669285565780689},{"$f":"'[3]Trustee Assets NEW'!E2108","v":3931556.26},{"$f":"(F4/$F$9)*100","v":8.864147593751294E-2},null,null,null,"£"]
[null,"Fixed Rate Loans",null,{"$f":"'[3]Trustee Assets NEW'!E2089","v":879},{"$f":"(D5/$D$9)*100","v":0.96184358825653538},{"$f":"'[3]Trustee Assets NEW'!E2109","v":54148863.93},{"$f":"(F5/$F$9)*100","v":1.220848666958859},null,"Substitution & Top up",0,0]
[null,"Bank of England Base Rate Tracker Loans",null,{"$f":"'[3]Trustee Assets NEW'!$E$2090","v":53773},{"$f":"(D6/$D$9)*100","v":58.840973004913167},{"$f":"'[3]Trustee Assets NEW'!E2110","v":2573085119.21},{"$f":"(F6/$F$9)*100","v":58.013175342332723},null,"Redeemed this period",{"$f":"+'[3]Trustee Assets NEW'!$E$2209","v":1389},{"$f":"+'Page 3'!N10-'Page 4'!K7","v":21377667.460000716}]
[null,"Standard Variable Loans",null,{"$f":"'[3]Trustee Assets NEW'!$E$2091","v":36473},{"$f":"(D7/$D$9)*100","v":39.910490551172487},{"$f":"'[3]Trustee Assets NEW'!E2111","v":1804180576.4200001},{"$f":"(F7/$F$9)*100","v":40.677334514770919},null,"Repurchases this period (including arrears)*",{"$f":"'[3]Trustee Assets NEW'!$E$2184","v":488},{"$f":"-'[3]Trustee Assets NEW'!$E$2185","v":32450999.990000002}]
[null,"Unknown",null,{"$f":"'[3]Trustee Assets NEW'!$E$2092","v":0},{"$f":"D8/$D$9","v":0},0,0,null,"Arrears repurchased this period*",{"$f":"'[3]Trustee Assets NEW'!$E$2173","v":187},{"$f":"-'[3]Trustee Assets NEW'!$E$2174","v":11284287.039999999}]
[null,"Total",null,{"$f":"SUM(D4:D8)","v":91387},{"$f":"SUM(E4:E8)","v":100},{"$f":"SUM(F4:F7)","v":4435346115.8199997},{"$f":"SUM(G4:G7)","v":100.00000000000001},null,"Cumulative arrears repurchased*",{"$f":"'[3]Trustee Assets NEW'!$E$2189","v":8433},{"$f":"-'[3]Trustee Assets NEW'!$E$2190","v":893843561.21999991}]
[null,null,null,null,null,null,null,null,"* “Arrears” for this purpose means, in respect of a Loan, on any date that two or more Monthly Payments have become due and remain unpaid by the relevant Borrower, and this reporting line relates to repurchases under clause 8.11 of the Mortgage Sale Agreement.  "]
{"$rows_left_out":54}
{"sheet":"Page 5","index":4,"n_rows":53,"n_cols":18,"rows_kept":53,"cut":false,"hidden":false,"merged":[[13,7,14,11],[15,1,16,5],[28,7,29,11],[43,7,43,11],[52,1,53,5]]}
[]
[null,"Remaining Term","Number","%","Current balance","%",null,"Indexed Current Loan to Value","Number","%","Current balance","%",null,null,null,"Errors",{"$f":"IF(IFERROR(SUM(B1:N70),\"Check\")<>\"Check\",\"Ok\",\"Check\")","v":"Ok"}]
[null,null,"of accounts","by number","£","by balance",null,"Using current capital balance and HPI indexed latest valuation ","of accounts","by number","£","by balance",null,null,null,"Remaining Term",{"$f":"IF(C15=INDEX('[3]Trustee Assets'!$37:$37,MATCH('Page 1'!$E$15,'[3]Trustee Assets'!$6:$6,0)),\"OK\",\"Check\")","v":{"$error":"#N/A"}},{"$f":"IF(E15=INDEX('[3]Trustee Assets'!$93:$93,MATCH('Page 1'!E15,'[3]Trustee Assets'!$6:$6,0)),\"OK\",\"Check\")","v":{"$error":"#N/A"}}]
[null,"0 to <5",{"$f":"+SUM('[3]Trustee Assets NEW'!$E$2016:$E$2017)","v":26924},{"$f":"(C4/$C$15)*100","v":29.461520785232036},{"$f":"SUM('[3]Trustee Assets NEW'!$E$2050:$E$2051)","v":697421709.81999993},{"$f":"(E4/$E$15)*100","v":15.724177811793203},null,">0% =<25%",{"$f":"'[3]Trustee Assets NEW'!$E$1768","v":40404},{"$f":"(I4/$I$13)*100","v":44.211977633580268},{"$f":"'[3]Trustee Assets NEW'!$E$1814","v":779843687.20000005},{"$f":"(K4/$K$13)*100","v":17.58247647051607},null,null,null,"Seasoning",{"$f":"IF(C52=INDEX('[3]Trustee Assets'!$37:$37,MATCH('Page 1'!$E$15,'[3]Trustee Assets'!$6:$6,0)),\"OK\",\"Check\")","v":{"$error":"#N/A"}},{"$f":"IF(E52=INDEX('[3]Trustee Assets'!$93:$93,MATCH('Page 1'!$E$15,'[3]Trustee Assets'!$6:$6,0)),\"OK\",\"Check\")","v":{"$error":"#N/A"}}]
[null,">= 5 to < 10",{"$f":"'[3]Trustee Assets NEW'!$E$2018","v":29197},{"$f":"(C5/$C$15)*100","v":31.948745445194611},{"$f":"'[3]Trustee Assets NEW'!$E$2052","v":1297122433.9100001},29.245123154727924,null,">25% =<50%",{"$f":"SUM('[3]Trustee Assets NEW'!$E$1769:$E$1770)","v":30943},{"$f":"(I5/$I$13)*100","v":33.859301651219539},{"$f":"SUM('[3]Trustee Assets NEW'!$E$1815:$E$1816)","v":1900637787.02},42.852073713949892,null,null,null,"Indexed LTV",{"$f":"IF(I13=INDEX('[3]Trustee Assets'!$37:$37,MATCH('Page 1'!$E$15,'[3]Trustee Assets'!$6:$6,0)),\"OK\",\"Check\")","v":{"$error":"#N/A"}},{"$f":"IF(K13=INDEX('[3]Trustee Assets'!$93:$93,MATCH('Page 1'!$E$15,'[3]Trustee Assets'!$6:$6,0)),\"OK\",\"Check\")","v":{"$error":"#N/A"}}]
[null,">= 10 to < 15",{"$f":"'[3]Trustee Assets NEW'!$E$2019","v":26631},29.140906255813192,{"$f":"'[3]Trustee Assets NEW'!$E$2053","v":1764775989.72},39.788912604258655,null,">50% =<75%",{"$f":"SUM('[3]Trustee Assets NEW'!$E$1771:$E$1775)","v":16896},18.48840644730651,{"$f":"SUM('[3]Trustee Assets NEW'!$E$1817:$E$1821)","v":1476857932.5699999},33.297467525754989,null,null,null,"LTV @Last Valuation",{"$f":"IF(I28=INDEX('[3]Trustee Assets'!$37:$37,MATCH('Page 1'!$E$15,'[3]Trustee Assets'!$6:$6,0)),\"OK\",\"Check\")","v":{"$error":"#N/A"}},{"$f":"IF(K28=INDEX('[3]Trustee Assets'!$93:$93,MATCH('Page 1'!$E$15,'[3]Trustee Assets'!$6:$6,0)),\"OK\",\"Check\")","v":{"$error":"#N/A"}}]
[null,">=15 to < 20",{"$f":"'[3]Trustee Assets NEW'!E2020","v":7587},8.3020560911289358,{"$f":"'[3]Trustee Assets NEW'!$E$2054","v":588909820.51999998},13.277651960902794,null,">75% =<80%",{"$f":"'[3]Trustee Assets NEW'!E1776","v":1181},1.2923063455414883,{"$f":"'[3]Trustee Assets NEW'!E1822","v":103728084.98},2.3386694582869754,null,null,null,"Original LTV",{"$f":"IF(I43=INDEX('[3]Trustee Assets'!$37:$37,MATCH('Page 1'!$E$15,'[3]Trustee Assets'!$6:$6,0)),\"OK\",\"Check\")","v":{"$error":"#N/A"}},{"$f":"IF(K28=INDEX('[3]Trustee Assets'!$93:$93,MATCH('Page 1'!$E$15,'[3]Trustee Assets'!$6:$6,0)),\"OK\",\"Check\")","v":{"$error":"#N/A"}}]
[null,">= 20 to < 25",{"$f":"'[3]Trustee Assets NEW'!E2021","v":754},0.82506264567170384,{"$f":"'[3]Trustee Assets NEW'!$E$2055","v":60879696.899999999},1.3726030688530531,null,">80% =<85%",{"$f":"'[3]Trustee Assets NEW'!E1777","v":846},0.92573341941413978,{"$f":"'[3]Trustee Assets NEW'!E1823","v":71275311.879999995},1.6069842131547545]
[null,">= 25 to < 30",{"$f":"'[3]Trustee Assets NEW'!E2022","v":271},0.29654108352391478,{"$f":"'[3]Trustee Assets NEW'!$E$2056","v":22111679.789999999},0.49853335484083255,null,">85% =<90%",{"$f":"'[3]Trustee Assets NEW'!E1778","v":678},0.74189983258012626,{"$f":"'[3]Trustee Assets NEW'!E1824","v":62486007.770000003},1.4088192023419501]
[null,">= 30 to < 35",{"$f":"'[3]Trustee Assets NEW'!E2023","v":23},2.5167693435609005E-2,{"$f":"'[3]Trustee Assets NEW'!$E$2057","v":4124785.16},9.2998044623568629E-2,null,">90% =<95%",{"$f":"'[3]Trustee Assets NEW'!E1779","v":329},0.36000744088327663,{"$f":"'[3]Trustee Assets NEW'!E1825","v":30547246.260000002},0.68872294207308937]
{"$rows_left_out":44}
{"sheet":"Page 6","index":5,"n_rows":34,"n_cols":21,"rows_kept":34,"cut":false,"hidden":false,"merged":[[28,9,28,10],[3,2,3,5],[4,9,4,10],[17,9,17,10]]}
[]
[null,"LOAN NOTE REPORT"]
[]
[]
[null,"Closing Date","2011-09-21",null,null,null,null,null,null,"Series 2011-3 Notes"]
[]
[null,"2011-3","ISIN (Reg S)","ISIN (144a)","Current Ratings\nS&P/Moody's/Fitch","Original Ratings\nS&P/Moody's/Fitch","Currency","Applicable Exchange Rate","Original Balance","Repaid","Outstanding","Reference rate","Margin p.a.%","Current interest rate p.a.%","Accrual Period","Next coupon date","Interest next coupon","Step up Date","Legal Maturity","Bond Type"]
[]
[null,"A1","XS0679914787","US43641NBG88","A-1+/P-1/F1+","A-1+/P-1/F1+","USD",1.5793999999999999,500000000,-500000000,0,"1M USD LIBOR",1.2999999999999999E-3,null,"-","-","-","n/a","2012-07-01","Bullet"]
[null,"A2","XS0679914860","US43641NBH61","AAA/Aaa/AAA","AAA/Aaa/AAA","USD",1.5767500000000001,2000000000,-2000000000,0,"3M USD LIBOR",1.55E-2,null,"-","-","-","2015-01-01","2054-10-01","Sched AM"]
{"$rows_left_out":25}
{"sheet":"Page 7","index":6,"n_rows":55,"n_cols":13,"rows_kept":55,"cut":false,"hidden":false,"merged":[[49,2,50,3],[51,2,51,3],[52,2,52,3],[53,2,53,3],[54,2,54,3]]}
[]
[null,"Combined Credit Enhancement","Total","Total","Current note","Subordination","% Required"]
[null,null,"£","%","subordination","+Reserve Fund"]
[]
[null,"Class A Notes",{"$f":"INDEX('[3]Interco - Funding'!$1:$1048576,MATCH((LEFT(B5,7)&\"             (IR)\"),'[3]Interco - Funding'!$C:$C,0),MATCH(EOMONTH('Page 1'!$E$15,-1)+1,'[3]Interco - Funding'!$17:$17,0))","v":1314683544.3},{"$f":"C5/C8","v":0.77232417310991341},{"$f":"SUM(C6:C7)/C8","v":0.22767582689008659},{"$f":"(C6+C7+C11)/$C$8","v":0.28642184044281083},0.23100000000000001]
[null,"Class B Notes",{"$f":"INDEX('[3]Interco - Funding'!$1:$1048576,MATCH((LEFT(B6,7)&\"             (IR)\"),'[3]Interco - Funding'!$C:$C,0),MATCH(EOMONTH('Page 1'!$E$15,-1)+1,'[3]Interco - Funding'!$17:$17,0))","v":0},{"$f":"C6/C8","v":0},{"$f":"C7/C8","v":0.22767582689008659},{"$f":"(C7+C11)/$C$8","v":0.28642184044281083},5.7000000000000002E-2]
[null,"Class Z Notes",{"$f":"INDEX('[3]Interco - Funding'!$1:$1048576,MATCH((LEFT(B7,7)&\"             (IR)\"),'[3]Interco - Funding'!$C:$C,0),MATCH(EOMONTH('Page 1'!$E$15,-1)+1,'[3]Interco - Funding'!$17:$17,0))","v":387559620},{"$f":"C7/C8","v":0.22767582689008659},0,{"$f":"(C11)/$C$8","v":5.8746013552724241E-2}]
[null,null,{"$f":"SUM(C5:C7)","v":1702243164.3},1.0000000000000002]
[]
[]
{"$rows_left_out":46}
{"sheet":"Page 8","index":7,"n_rows":73,"n_cols":9,"rows_kept":73,"cut":false,"hidden":false,"merged":[]}
["WATERFALLS"]
[]
[null,"MORTGAGES TRUSTEE REVENUE WATERFALL",null,null,"FUNDING REVENUE WATERFALL",null,null,"ISSUER REVENUE WATERFALL"]
[null,{"$f":"\"*for distribution period  \"&TEXT(EOMONTH('Page 1'!E15,-2)+1,\"dd mmmm yyyy\")&\"- \"&TEXT(EOMONTH('Page 1'!E15,-1)+1,\"dd mmmm yyyy\")","v":"*for distribution period  01 December 2017- 01 January 2018"}]
["(a)","Mortgages Trustee fees",{"$f":"INDEX('[3]Waterfall - Trustees'!$1:$1048576,MATCH(B5,'[3]Waterfall - Trustees'!$C:$C,0),MATCH(EOMONTH('Page 1'!E15,-1),'[3]Waterfall - Trustees'!$5:$5,0))","v":0},"(a)","Funding Security Trustee fees",0,"(a)","Issuing Entity Security Trustee fees",{"$f":"INDEX('[3]Waterfall - Issuer'!$1:$1048576,MATCH(G5,'[3]Waterfall - Issuer'!$B:$B,0),MATCH(+TEXT(DATE(2000,MONTH('Page 1'!E15),1),\"mmm\")&+TEXT(DATE(YEAR('Page 1'!E15),1,1),\"yy\"),'[3]Waterfall - Issuer'!$2:$2,0))","v":14100}]
[null,"Other third party payments ",{"$f":"INDEX('[3]Waterfall - Trustees'!$1:$1048576,MATCH(B6,'[3]Waterfall - Trustees'!$C:$C,0),MATCH(EOMONTH('Page 1'!E15,-1),'[3]Waterfall - Trustees'!$5:$5,0))","v":0},null,"Fee under Intercompany Loan",{"$f":"INDEX('[3]Waterfall - Funding'!$1:$1048576,MATCH(E6,'[3]Waterfall - Funding'!$M:$M,0),MATCH(TEXT(DATE(2000,MONTH('Page 1'!E17),1),\"mmm\")&+TEXT(DATE(YEAR('Page 1'!E17),1,1),\"yy\"),'[3]Waterfall - Funding'!$2:$2,0))","v":143951.02499999999},null,"Note Trustee fees",0]
[null,null,null,null,"Other third party payments",0,null,"Agent Bank fees etc.",0]
[]
["(b)","Servicer fee",{"$f":"INDEX('[3]Waterfall - Trustees'!$1:$1048576,MATCH(B9,'[3]Waterfall - Trustees'!$C:$C,0),MATCH(EOMONTH('Page 1'!E15,-1),'[3]Waterfall - Trustees'!$5:$5,0))","v":162296.06}]
[null,null,null,"(b)","Cash Manager fees",{"$f":"INDEX('[3]Waterfall - Funding'!$1:$1048576,MATCH(E10,'[3]Waterfall - Funding'!$C:$C,0),MATCH(TEXT(DATE(2000,MONTH('Page 1'!E17),1),\"mmm\")&+TEXT(DATE(YEAR('Page 1'!E17),1,1),\"yy\"),'[3]Waterfall - Funding'!$2:$2,0))","v":29375},"(b)","Other third party payments",{"$f":"INDEX('[3]Waterfall - Issuer'!$1:$1048576,MATCH(G10,'[3]Waterfall - Issuer'!$B:$B,0),MATCH(+TEXT(DATE(2000,MONTH('Page 1'!E15),1),\"mmm\")&+TEXT(DATE(YEAR('Page 1'!E15),1,1),\"yy\"),'[3]Waterfall - Issuer'!$2:$2,0))","v":84726.024999999994}]
{"$rows_left_out":64}
{"sheet":"Page 9","index":8,"n_rows":16,"n_cols":15,"rows_kept":16,"cut":false,"hidden":false,"merged":[]}
[null,"SWAP PAYMENTS"]
[]
[]
[null,"Note","Swap Counterparty","Currency Notional","Receive Reference Rate","Receive Margin","Receive Rate","Interest Received","Principal Received","£ Notional","Pay reference rate","Pay margin ","Pay rate","Interest Paid","Principal Paid"]
[null,"Funding 1 Swap","SAN UK",{"$f":"+INDEX('[3]Waterfall - Funding'!$178:$178,MATCH('Page 1'!$E$18,'[3]Waterfall - Funding'!$6:$6,0))","v":1702243164.3},"3M GBP LIBOR",1.794481820180216E-2,{"$f":"+INDEX('[3]Waterfall - Funding'!$180:$180,MATCH('Page 1'!$E$18,'[3]Waterfall - Funding'!$6:$6,0))","v":2.0971749894080991E-2},{"$f":"+INDEX('[3]Waterfall - Funding'!$181:$181,MATCH('Page 1'!$E$18,'[3]Waterfall - Funding'!$6:$6,0))","v":8997496.3920016196},{"$f":"+INDEX('[3]Waterfall - Funding'!$182:$182,MATCH('Page 1'!$E$18,'[3]Waterfall - Funding'!$6:$6,0))","v":0},{"$f":"+INDEX('[3]Waterfall - Funding'!$183:$183,MATCH('Page 1'!$E$18,'[3]Waterfall - Funding'!$6:$6,0))","v":1702243164.3},"3M GBP LIBOR",0,{"$f":"+INDEX('[3]Waterfall - Funding'!$186:$186,MATCH('Page 1'!$E$18,'[3]Waterfall - Funding'!$6:$6,0))","v":2.6736989171914017E-2},{"$f":"+INDEX('[3]Waterfall - Funding'!$187:$187,MATCH('Page 1'!$E$18,'[3]Waterfall - Funding'!$6:$6,0))","v":11471733.832248069},{"$f":"+INDEX('[3]Waterfall - Funding'!$188:$188,MATCH('Page 1'!$E$18,'[3]Waterfall - Funding'!$6:$6,0))","v":0}]
[null,"2011-3 A5","ANTS",{"$f":"+INDEX('[3]Notes - Issuer'!$457:$457,MATCH('Page 1'!$E$18,'[3]Notes - Issuer'!$6:$6,0))","v":500000000},"USD FIXED",0,{"$f":"+'Page 6'!$N$13","v":3.6150000000000002E-2},{"$f":"IF(OR(MONTH('Page 1'!E18)=1,MONTH('Page 1'!E18)=7),INDEX('[3]Notes - Issuer'!$474:$474,MATCH(TEXT(DATE(2000,MONTH('Page 1'!$E$17),1),\"mmm\")&+TEXT(DATE(YEAR('Page 1'!$E$17),1,1),\"yy\"),'[3]Notes - Issuer'!$2:$2,0)),0)","v":9037500},{"$f":"+INDEX('[3]Notes - Issuer'!$462:$462,MATCH('Page 1'!$E$18,'[3]Notes - Issuer'!$6:$6,0))","v":0},{"$f":"+INDEX('[3]Interco - Funding'!$262:$262,MATCH('Page 1'!$E$18,'[3]Interco - Funding'!$6:$6,0))+INDEX('[3]Interco - Funding'!$250:$250,MATCH('Page 1'!$E$18,'[3]Interco - Funding'!$6:$6,0))","v":316455696.19999999},"3M GBP LIBOR",1.755E-2,{"$f":"+INDEX('[3]Interco - Funding'!$256:$256,MATCH('Page 1'!$E$18,'[3]Interco - Funding'!$6:$6,0))","v":2.1337499999999999E-2},{"$f":"+INDEX('[3]Interco - Funding'!$258:$258,MATCH('Page 1'!$E$18,'[3]Interco - Funding'!$6:$6,0))","v":1701968.0943161915},{"$f":"+INDEX('[3]Interco - Funding'!$250:$250,MATCH('Page 1'!$E$18,'[3]Interco - Funding'!$6:$6,0))","v":0}]
[null,"2011-3 A6","ANTS",{"$f":"+INDEX('[3]Notes - Issuer'!$512:$512,MATCH('Page 1'!$E$18,'[3]Notes - Issuer'!$6:$6,0))","v":250000000},"3M USD LIBOR",1.7500000000000002E-2,{"$f":"INDEX('[3]Notes - Issuer'!$525:$525,MATCH(TEXT(DATE(2000,MONTH('Page 1'!E17),1),\"mmm\")&+TEXT(DATE(YEAR('Page 1'!E17),1,1),\"yy\"),'[3]Notes - Issuer'!$2:$2,0)-1)","v":3.10917E-2},{"$f":"INDEX('[3]Notes - Issuer'!$529:$529,MATCH(TEXT(DATE(2000,MONTH('Page 1'!E17),1),\"mmm\")&+TEXT(DATE(YEAR('Page 1'!E17),1,1),\"yy\"),'[3]Notes - Issuer'!$2:$2,0)-1)","v":1986414.17},{"$f":"+INDEX('[3]Notes - Issuer'!$517:$517,MATCH('Page 1'!$E$18,'[3]Notes - Issuer'!$6:$6,0))","v":0},{"$f":"+INDEX('[3]Interco - Funding'!$291:$291,MATCH('Page 1'!$E$18,'[3]Interco - Funding'!$6:$6,0))+INDEX('[3]Interco - Funding'!$279:$279,MATCH('Page 1'!$E$18,'[3]Interco - Funding'!$6:$6,0))","v":158227848.09999999},"3M GBP LIBOR",1.755E-2,{"$f":"+INDEX('[3]Interco - Funding'!$285:$285,MATCH('Page 1'!$E$18,'[3]Interco - Funding'!$6:$6,0))","v":2.1337499999999999E-2},{"$f":"+INDEX('[3]Interco - Funding'!$287:$287,MATCH('Page 1'!$E$18,'[3]Interco - Funding'!$6:$6,0))","v":850984.04715809575},{"$f":"+INDEX('[3]Interco - Funding'!$279:$279,MATCH('Page 1'!$E$18,'[3]Interco - Funding'!$6:$6,0))","v":0}]
[]
[]
[]
{"$rows_left_out":7}
{"sheet":"Page 10","index":9,"n_rows":54,"n_cols":3,"rows_kept":54,"cut":false,"hidden":false,"merged":[[21,1,22,1]]}
[null,"TRIGGER EVENTS"]
[null,"Asset "]
[null,"  Amount debited to AAA Principal Deficiency Sub Ledger, unless certain criteria are met","None"]
[]
[null,"Non Asset "]
[null,"  Insolvency Event occurs in relation to Seller.","None"]
[null,"  Seller's role as Servicer terminated & new servicer appointed within 60 days.","None"]
[null,"  The then current Seller Share is less than the Minimum Seller Share.","None"]
[]
[]
{"$rows_left_out":45}
{"sheet":"Sheet1","index":10,"n_rows":7,"n_cols":2,"rows_kept":7,"cut":false,"hidden":true,"merged":[]}
[]
[]
[null,"MARTA GONZALEZ DEPRIT"]
[null,"TARGOL RASHTCHI"]
[null,"ALVARO RUIZ DE ALDA"]
[null,"JAMIE WILSON ADAMS"]
[null,"MARTIN MCKINNEY"]