{"text_format":"1","workbook":"xlsx","n_sheets":10,"sheets":["Page 1","Page 2","Page 3","Page 4","Page 5","Page 6","Page 7","Page 8","Page 9","Page 10"],"not_rendered":{"charts":0,"images":2,"macros":1,"external_links":12,"defined_names":1127,"comments":0,"pivot_tables":0},"unopened":[],"bounds":{"document_bytes":16777216,"sheet_cells":100000,"rows_first":2000,"rows_last":500,"rows_between":2000,"halvings":0,"cell_chars":16384,"cell_head_chars":4096},"cells_cut":0,"cells_raw":0,"read":"whole","date_system":"1900"}

{"sheet":"Page 1","index":0,"n_rows":32,"n_cols":25,"rows_kept":32,"cut":false,"hidden":false,"merged":[[26,1,26,2],[19,1,19,16],[21,1,21,16]]}
[]
[]
[]
[]
[]
[]
[]
[]
[]
[]
[]
[]
[]
[]
[null,"Report Date:",null,null,{"$f":"EOMONTH('[12]Waterfall - Trustees'!$E$5,1)","v":"2025-03-31"},null," "]
{"$rows_left_out":18}
{"sheet":"Page 2","index":1,"n_rows":34,"n_cols":7,"rows_kept":34,"cut":false,"hidden":false,"merged":[[25,2,26,2],[25,3,26,3],[30,1,30,6]]}
[]
[null,"MAIN PARTIES TO THE STRUCTURE, RATINGS AND TRIGGERS (IF APPLICABLE)"]
[]
[null,null,null,"Fitch/Moody's/S&P Long Term Rating ","Fitch/Moody's/S&P Short Term Rating ","Applicable Trigger (loss of)","Consequence"]
[null,"Issuer","Fosse Master Issuer plc"]
[null,"Funding","Fosse Funding (No. 1) Limited"]
[null,"Mortgages Trustee  ","Fosse Trustee Limited"]
[null,"Seller","Santander UK","A+ / A1/ A","F1 / P-1 / A-1","A-(Fitch) / A3 (Moody's)","Funding 1 required to establish a Liquidity Reserve Fund."]
[null,null,null,null,null,"BBB- / Baa3 / A-2","Notice to be given to Borrowers of transfer of equitable and beneficial interest in the Loans, but no need to perfect legal title to the Loans."]
[null,null,null,null,null,"BBB- (Fitch) / BBB- (S&P)","Completion of legal assignment of Loans to Mortgages Trustee and perfection of transfer of Related Security."]
[null,null,null,null,null,"F2 / P-2 / A-3","Seller unable to sell in New Loans, Funding 1 unable to make Initial Contributions, Further Contributions or Refinancing Contributions."]
[null,null,null,null,null,"BBB- / Baa3 / BBB-","Adjustment to Minimum Seller Share calculation."]
[null,null,null,null,null,"A3 (Moody's)","Independent audit of a random selection of Loans in the Portfolio to verify that the representations and warranties relating to them were complied with as of their Assignment Date."]
[null,null,null,null,null,"F2 or BBB+ / P-2 / A-2 or BBB","Transfer of Seller collection accounts to another bank with these minimum ratings or payments to be made directly to the Mortgages Trustee GIC Account."]
[null,"Servicer","Santander UK","A+ / A1/ A","F1 / P-1 / A-1","F2 / P-2 / A-2","The title deeds and the customer files relating to the Loans in the Portfolio to be segregated from the title deeds and customer files of other properties and mortgages of the Seller which do not form part of the Portfolio."]
{"$rows_left_out":20}
{"sheet":"Page 3","index":2,"n_rows":69,"n_cols":14,"rows_kept":69,"cut":false,"hidden":false,"merged":[[24,1,24,2],[47,1,47,5],[49,1,50,2]]}
[]
[null,"COLLATERAL REPORT"]
[]
[null,"Mortgage Loan Profile",null,null,null,null,null,null,null,"Trust Assets"]
[]
[null,"Original number of Mortgage Loans in Pool",null,null,null,42395,null,null,null,{"$f":"\"Current value of Mortgage Loans in Pool at\"&\" \"&TEXT(EOMONTH('Page 1'!E15,-1)+1,\"dd mmmm yyyy\")","v":"Current value of Mortgage Loans in Pool at 01 March 2025"},null,null,null,{"$f":"ROUND('[12]Trustee Assets'!$E$14,2)","v":2304338598.4400001}]
[null,"Original current value of Mortgage Loans in Pool",null,null,null,3399995370,null,null,null,{"$f":"\"Last months Closing Trust Assets at\"&\" \"&TEXT(EOMONTH('Page 1'!E15,-2)+1,\"dd mmmm yyyy\")","v":"Last months Closing Trust Assets at 01 February 2025"},null,null,null,{"$f":"INDEX('[12]Trustee Assets'!$14:$14,MATCH(EOMONTH('Page 1'!E15,-2),'[12]Trustee Assets'!$6:$6,0))","v":2340993610.6399999}]
[null,{"$f":"\"Current number of Mortgage Loans in Pool at\"&\" \"&TEXT(EOMONTH('Page 1'!E15,-1)+1,\"dd mmmm yyyy\")","v":"Current number of Mortgage Loans in Pool at 01 March 2025"},null,null,null,{"$f":"D39","v":13218},null,null,null,{"$f":"\"Mortgage collections - Interest on\"&\" \"&TEXT(EOMONTH('Page 1'!E15,-1)+1,\"dd mmmm yyyy\")","v":"Mortgage collections - Interest on 01 March 2025"},null,null,null,{"$f":"'[12]Waterfall - Trustees'!$E$238","v":5546888.7699999996}]
[null,{"$f":"\"Current £ value of Mortgage Loans in Pool at\"&\" \"&TEXT(EOMONTH('Page 1'!E15,-1)+1,\"dd mmmm yyyy\")","v":"Current £ value of Mortgage Loans in Pool at 01 March 2025"},null,null,null,{"$f":"E39","v":2304338598.4400001},null,null,null,{"$f":"\"Mortgage collections - Principal (Scheduled) on\"&\" \"&TEXT(EOMONTH('Page 1'!E15,-1)+1,\"dd mmmm yyyy\")","v":"Mortgage collections - Principal (Scheduled) on 01 March 2025"},null,null,null,{"$f":"'[12]Waterfall - Trustees'!$E$513","v":7331750.7599999998}]
[null,{"$f":"\"Weighted Average Yield\"&\" \"&TEXT(EOMONTH('Page 1'!E15,-1)+8,\"dd mmmm yyyy\")","v":"Weighted Average Yield 08 March 2025"},null,null,null,{"$f":"'[12]Trustee Assets'!$E$2335","v":2.7211515003028271E-2},null,null,null,{"$f":"\"Mortgage collections - Principal (Unscheduled) on\"&\" \"&TEXT(EOMONTH('Page 1'!E15,-1)+1,\"dd mmmm yyyy\")","v":"Mortgage collections - Principal (Unscheduled) on 01 March 2025"},null,null,null,{"$f":"'Page 8'!C22+'Page 8'!C25-'Page 3'!N9","v":29352728.440000005}]
[null,null,null,null,null,null,null,null,null,{"$f":"\"Principal Ledger as calculated on\"&\" \"&TEXT('Page 1'!E17,\"dd mmmm yyyy\")","v":"Principal Ledger as calculated on 01 March 2025"},null,null,null,{"$f":"INDEX('[12]Waterfall - Funding'!$175:$175,MATCH(EOMONTH('Page 1'!E15,0),'[12]Waterfall - Funding'!$15:$15,0))","v":0}]
[null,null,null,null,null,null,null,null,null,{"$f":"\"Funding Share as calculated on \"&TEXT('Page 1'!E17,\"DD MMMM YYYY\")","v":"Funding Share as calculated on 01 March 2025"},null,null,null,{"$f":"'[12]Waterfall - Trustees'!$E$26","v":1393679000}]
[null,null,null,null,null,null,null,null,null,{"$f":"\"Funding Share % as calculated on \"&TEXT('Page 1'!E17,\"DD MMMM YYYY\")","v":"Funding Share % as calculated on 01 March 2025"},null,null,null,{"$f":"'[12]Waterfall - Trustees'!$E$17","v":0.59533650000000005}]
[null,null,null,null,null,null,null,null,null,{"$f":"\"Seller Share as calculated on \"&TEXT('Page 1'!E17,\"DD MMMM YYYY\")","v":"Seller Share as calculated on 01 March 2025"},null,null,null,{"$f":"'[12]Waterfall - Trustees'!$E$51","v":947314610.63999999}]
[null,null,null,null,null,null,null,null,null,{"$f":"\"Seller Share % as calculated on \"&TEXT('Page 1'!E17,\"DD MMMM YYYY\")","v":"Seller Share % as calculated on 01 March 2025"},null,null,null,{"$f":"'[12]Waterfall - Trustees'!$E$19","v":0.40466350000000001}]
{"$rows_left_out":55}
{"sheet":"Page 4","index":3,"n_rows":61,"n_cols":14,"rows_kept":61,"cut":false,"hidden":false,"merged":[[1,8,3,8],[3,1,3,2],[4,1,4,2],[5,1,5,2],[6,1,6,2],[44,1,44,6],[47,1,48,2],[7,1,7,2],[9,8,10,10],[12,8,13,8],[22,8,23,9],[25,1,25,2]]}
[]
[null,"Product Breakdown",null,"Number","%","£","%",null,{"$f":"\"Substitution, redemptions and repurchases during period \"&TEXT(EOMONTH('Page 1'!E15,-2)+1,\"dd mmmm yyyy\")&\"- \"&TEXT(EOMONTH('Page 1'!E15,-1)+1,\"dd mmmm yyyy\")","v":"Substitution, redemptions and repurchases during period 01 February 2025- 01 March 2025"},"Number of loans","Current balance"]
[null,"(By Balance)",null,"of loans","by number","Current Balance","by balance",null,null,"this period","this period"]
[null,"Discounted SVR Loans",null,{"$f":"'[12]Trustee Assets'!E2104","v":0},{"$f":"(D4/$D$8)*100","v":0},{"$f":"'[12]Trustee Assets'!E2124","v":0},{"$f":"(F4/$F$8)*100","v":0},null,null,null,"£"]
[null,"Fixed Rate Loans",null,{"$f":"'[12]Trustee Assets'!E2105","v":12514},{"$f":"(D5/$D$8)*100","v":94.673929490089265},{"$f":"'[12]Trustee Assets'!E2125","v":2225820143.3699999},{"$f":"(F5/$F$8)*100","v":96.59258170118072},null,"Substitution & Top up",{"$f":"'[12]Trustee Assets'!$E$2268","v":0},{"$f":"'[12]Trustee Assets'!$E$2269","v":0}]
[null,"Bank of England Base Rate Tracker Loans",null,{"$f":"'[12]Trustee Assets'!E2106","v":565},{"$f":"(D6/$D$8)*100","v":4.2744742018459672},{"$f":"'[12]Trustee Assets'!E2126","v":72080325.569999993},{"$f":"(F6/$F$8)*100","v":3.1280266545375413},null,"Redeemed this period",{"$f":"'[12]Trustee Assets'!$E$2241","v":75},{"$f":"+'Page 3'!N10-'Page 4'!K7","v":13408222.680000007}]
[null,"Standard Variable Loans",null,{"$f":"'[12]Trustee Assets'!E2107","v":139},{"$f":"(D7/$D$8)*100","v":1.0515963080647601},{"$f":"'[12]Trustee Assets'!E2127","v":6438129.5},{"$f":"(F7/$F$8)*100","v":0.27939164428172619},null,"Repurchases this period (including arrears)*",{"$f":"'[12]Trustee Assets'!$E$2216","v":97},{"$f":"'[12]Trustee Assets'!$E$2217","v":15944505.759999998}]
[null,"Total",null,{"$f":"SUM(D4:D7)","v":13218},{"$f":"SUM(E4:E7)","v":99.999999999999986},{"$f":"SUM(F4:F7)","v":2304338598.4400001},{"$f":"SUM(G4:G7)","v":99.999999999999986},null,"Arrears repurchased this period*",{"$f":"'[12]Trustee Assets'!$E$2191","v":2},{"$f":"'[12]Trustee Assets'!$E$2192","v":471554.73}]
[null,null,null,null,null,null,null,null,"Cumulative arrears repurchased*",{"$f":"'[12]Trustee Assets'!$E$2221","v":2582},{"$f":"'[12]Trustee Assets'!$E$2222","v":246481024.44}]
[null,null,null,null,null,null,null,null,"* “Arrears” for this purpose means, in respect of a Loan, on any date that two or more Monthly Payments have become due and remain unpaid by the relevant Borrower, and this reporting line relates to repurchases under clause 8.11 of the Mortgage Sale Agreement."]
[null,"Payment Type",null,"Number","%","£","%"]
[null,"(By Balance)",null,"of loans","by number","Current Balance","by balance"]
[null,"Interest Only ",null,{"$f":"'[12]Trustee Assets'!E726","v":1433},{"$f":"(D13/D15)*100","v":10.841277046451808},{"$f":"'[12]Trustee Assets'!E756","v":305469523.25},{"$f":"(F13/$F$15)*100","v":13.256277677976575},null,{"$f":"\"PPR/CPR Analysis \"&TEXT(EOMONTH('Page 1'!E17,-2)+1,\"dd mmmm yyyy\")&\"- \"&TEXT(EOMONTH('Page 1'!E17,-1)+1,\"dd mmmm yyyy\")","v":"PPR/CPR Analysis 01 February 2025- 01 March 2025"},"1 Month","1 Month Annualised","3 Month Average ","3 Month Annualised","12 Month Average"]
[null,"Repayment",null,{"$f":"'[12]Trustee Assets'!E727","v":11785},{"$f":"(D14/D15)*100","v":89.158722953548192},{"$f":"'[12]Trustee Assets'!E757","v":1998869075.1900001},{"$f":"(F14/$F$15)*100","v":86.743722322023416},null,null,"%","%","%","%","%"]
[null,"Total",null,{"$f":"SUM(D13:D14)","v":13218},{"$f":"SUM(E13:E14)","v":100},{"$f":"SUM(F13:F14)","v":2304338598.4400001},{"$f":"SUM(G13:G14)","v":99.999999999999986},null,"Total (including unscheduled repayments and repurchases from the Mortgages Trust)"]
{"$rows_left_out":47}
{"sheet":"Page 5","index":4,"n_rows":53,"n_cols":12,"rows_kept":53,"cut":false,"hidden":false,"merged":[[13,7,14,11],[15,1,16,5],[28,7,29,11],[43,7,43,11],[52,1,53,5]]}
[]
[null,"Remaining Term","Number","%","£","%",null,"Indexed Current Loan to Value","Number","%","£","%"]
[null,null,"of loans","by number","Current Balance","by balance",null,"Using current capital balance and HPI indexed latest valuation ","of loans","by number","Current Balance","by balance"]
[null,"0 to <5",{"$f":"'[12]Trustee Assets'!$E$2032+'[12]Trustee Assets'!$E$2033","v":818},{"$f":"(C4/$C$15)*100","v":6.1885307913451353},{"$f":"'[12]Trustee Assets'!$E$2066+'[12]Trustee Assets'!$E$2067","v":67726711.710000008},{"$f":"(E4/$E$15)*100","v":2.9390954851795605},null,">0% =<25%",{"$f":"'[12]Trustee Assets'!E1784","v":2472},{"$f":"(I4/$I$13)*100","v":18.701770313209259},{"$f":"'[12]Trustee Assets'!$E$1830","v":186394602.41999999},{"$f":"(K4/$K$13)*100","v":8.0888547605888359}]
[null,">= 5 to < 10",{"$f":"'[12]Trustee Assets'!$E$2034","v":1685},{"$f":"(C5/$C$15)*100","v":12.747768194885762},{"$f":"'[12]Trustee Assets'!E2068","v":175245151.15000001},7.6050087113342686,null,">25% =<50%",{"$f":"'[12]Trustee Assets'!E1785+'[12]Trustee Assets'!$E$1786","v":5194},{"$f":"(I5/$I$13)*100","v":39.294900892722048},{"$f":"'[12]Trustee Assets'!$E$1831+'[12]Trustee Assets'!$E$1832","v":905118304.94000006},39.278876183940611]
[null,">= 10 to < 15",{"$f":"'[12]Trustee Assets'!E2035","v":2203},16.666666666666664,{"$f":"'[12]Trustee Assets'!E2069","v":314908831.86000001},13.665909691969237,null,">50% =<75%",{"$f":"'[12]Trustee Assets'!$E$1787+'[12]Trustee Assets'!$E$1788+'[12]Trustee Assets'!$E$1789+'[12]Trustee Assets'!$E$1790+'[12]Trustee Assets'!$E$1791","v":4772},36.102284763201695,{"$f":"'[12]Trustee Assets'!$E$1833+'[12]Trustee Assets'!$E$1834+'[12]Trustee Assets'!$E$1835+'[12]Trustee Assets'!$E$1836+'[12]Trustee Assets'!$E$1837","v":1036302045.2900001},44.971778279093179]
[null,">=15 to < 20",{"$f":"'[12]Trustee Assets'!E2036","v":2994},22.650930549251022,{"$f":"'[12]Trustee Assets'!E2070","v":540177678.54999995},23.441766714131834,null,">75% =<80%",{"$f":"'[12]Trustee Assets'!E1792","v":342},2.5873808443032229,{"$f":"'[12]Trustee Assets'!E1838","v":76956554.170000002},3.3396374222997585]
[null,">= 20 to < 25",{"$f":"'[12]Trustee Assets'!E2037","v":3681},27.84838856105311,{"$f":"'[12]Trustee Assets'!E2071","v":783127683.87},33.984922372092576,null,">80% =<85%",{"$f":"'[12]Trustee Assets'!E1793","v":284},2.1485852625208048,{"$f":"'[12]Trustee Assets'!E1839","v":65457023.049999997},2.8405991677747942]
[null,">= 25 to < 30",{"$f":"'[12]Trustee Assets'!E2038","v":1837},13.897715236798305,{"$f":"'[12]Trustee Assets'!E2072","v":423152541.30000001},18.363297025292528,null,">85% =<90%",{"$f":"'[12]Trustee Assets'!E1794","v":136},1.0288999848691178,{"$f":"'[12]Trustee Assets'!E1840","v":31016000.52},1.3459827709780727]
[null,">= 30 to < 35",{"$f":"'[12]Trustee Assets'!E2039","v":0},0,{"$f":"'[12]Trustee Assets'!E2073","v":0},0,null,">90% =<95%",{"$f":"'[12]Trustee Assets'!E1795","v":17},0.12861249810863973,{"$f":"'[12]Trustee Assets'!E1841","v":2927048.37},0.1270233624512285]
[null,">= 35 to < 40",{"$f":"'[12]Trustee Assets'!E2040","v":0},0,{"$f":"'[12]Trustee Assets'!E2074","v":0},0,null,">95%",{"$f":"'[12]Trustee Assets'!$E$1796+'[12]Trustee Assets'!$E$1797+'[12]Trustee Assets'!$E$1798+'[12]Trustee Assets'!$E$1799+'[12]Trustee Assets'!$E$1800","v":1},7.5654410652141024E-3,{"$f":"'[12]Trustee Assets'!$E$1842+'[12]Trustee Assets'!$E$1843+'[12]Trustee Assets'!$E$1844+'[12]Trustee Assets'!$E$1845+'[12]Trustee Assets'!$E$1846","v":167019.68},7.248052873526035E-3]
[null,">= 40 to < 45",{"$f":"'[12]Trustee Assets'!E2041","v":0},0,{"$f":"'[12]Trustee Assets'!E2075","v":0},0,null,"Unknown",{"$f":"'[12]Trustee Assets'!$E$1801","v":0},0,{"$f":"'[12]Trustee Assets'!$E$1847","v":0},0]
[null,">= 45",{"$f":"'[12]Trustee Assets'!E2042","v":0},0,{"$f":"'[12]Trustee Assets'!E2076","v":0},0,null,"Total",{"$f":"SUM(I4:I12)","v":13218},{"$f":"SUM(J4:J12)","v":100},{"$f":"SUM(K4:K12)","v":2304338598.4400001},{"$f":"+SUM(L4:L12)","v":100}]
[null,"Unknown",{"$f":"'[12]Trustee Assets'!E2043","v":0},0,{"$f":"'[12]Trustee Assets'!E2077","v":0},0,null,{"$f":"\"As at the report date, the maximum indexed LTV was \"&'[12]Trustee Assets'!$E$40*100&\" %, and the weighted average indexed LTV was \"&ROUND('[12]Trustee Assets'!$E$41*100,2)&\"%\"","v":"As at the report date, the maximum indexed LTV was 95.96 %, and the weighted average indexed LTV was 50.41%"}]
[null,"Total",{"$f":"SUM(C4:C14)","v":13218},{"$f":"SUM(D4:D14)","v":100},{"$f":"SUM(E4:E14)","v":2304338598.4400001},{"$f":"SUM(F4:F14)","v":100}]
{"$rows_left_out":39}
{"sheet":"Page 6","index":5,"n_rows":35,"n_cols":20,"rows_kept":35,"cut":false,"hidden":false,"merged":[]}
[]
[null,"LOAN NOTE REPORT"]
[]
[]
[]
[]
[]
[null,"Closing Date","2019-10-15",null,null,"Series 2019-1 Notes"]
[]
[null,"2019-1","ISIN (Reg S)","ISIN (144a)","Ratings\nS&P/Moody's/Fitch","Initial Ratings S&P/Moody's/Fitch","Currency","Applicable Exchange Rate","Original Balance","Repaid","Outstanding","Reference rate","Margin p.a.%","Current interest rate  p.a.%*","Accrual Period","Next coupon date","Interest next coupon*","Step up Date","Legal Maturity","Bond Type"]
[]
[null,"A1*","XS2065728920","n/a","AAA/Aaa/AAA","AAA/Aaa/AAA","GBP",1,750000000,{"$f":"K12-I12","v":-750000000},0,"Compunded Daily SONIA",7.3000000000000001E-3,"-","-","-","-",{"$f":"'[12]Notes - Issuer'!$E$578","v":"2024-10-18"},"2054-10-18","Sched AM"]
[null,"A2*","XS2065729654","n/a","AAA/Aaa/AAA","AAA/Aaa/AAA","GBP",1,500000000,{"$f":"K13-I13","v":0},{"$f":"INDEX('[12]Notes - Issuer'!$653:$653,MATCH('Page 1'!E15,'[12]Notes - Issuer'!$9:$9,0))","v":500000000},"Compunded Daily SONIA",8.8000000000000005E-3,{"$f":"INDEX('[12]Notes - Issuer'!$665:$665,MATCH(EOMONTH('Page 1'!E15,0),'[12]Notes - Issuer'!$9:$9,0))","v":0},{"$f":"INDEX('[12]Notes - Issuer'!$670:$670,MATCH('Page 1'!E15,'[12]Notes - Issuer'!$9:$9,0))","v":"21/01/2025 - 22/04/2025"},{"$f":"INDEX('[12]Notes - Issuer'!$671:$671,MATCH('Page 1'!E15,'[12]Notes - Issuer'!$9:$9,0))","v":"2025-04-22"},{"$f":"IF(INDEX('[12]Notes - Issuer'!$667:$667,MATCH(EOMONTH('Page 1'!E15,0),'[12]Notes - Issuer'!$9:$9,0))=0,\"*\",INDEX('[12]Notes - Issuer'!$667:$667,MATCH(EOMONTH('Page 1'!E15,0),'[12]Notes - Issuer'!$9:$9,0)))","v":"*"},{"$f":"'[12]Notes - Issuer'!$E$642","v":"2029-10-18"},"2072-10-18","Sched AM"]
[null,"Z*","XS2065730074","N/A","N/A","N/A","GBP",1,215460000,{"$f":"K14-I14","v":-215460000},0,"Compunded Daily SONIA",8.9999999999999993E-3,"-","-","-","-","N/A","2054-10-18","P-Through"]
[]
{"$rows_left_out":21}
{"sheet":"Page 7","index":6,"n_rows":50,"n_cols":7,"rows_kept":50,"cut":false,"hidden":false,"merged":[[44,2,45,3],[46,2,46,3],[47,2,47,3],[48,2,48,3],[49,2,49,3]]}
[]
[null,"Combined Credit Enhancement","Total","% of Total","Current note","Subordination","% Required"]
[null,null,"£",null,"subordination","+Reserve Fund"]
[]
[null,"Class A Notes",{"$f":"'[12]Notes - Issuer'!$E$877","v":1250000000},{"$f":"C5/$C$10","v":0.89690667650154732},{"$f":"SUM(D6:D9)","v":0.10309332349845265},{"$f":"(C9+C13)/C10","v":0.13000052379349908},0.13]
[null,"Class B Notes",{"$f":"'[12]Notes - Issuer'!$E$878","v":0},{"$f":"C6/$C$10","v":0},0,0,0]
[null,"Class M Notes",{"$f":"'[12]Notes - Issuer'!$E$880","v":0},{"$f":"C7/$C$10","v":0},0,0,0]
[null,"Class C Notes",{"$f":"'[12]Notes - Issuer'!$E$880","v":0},{"$f":"C8/$C$10","v":0},0,0,0]
[null,"Class Z Notes",{"$f":"'[12]Notes - Issuer'!$E$881","v":143679000},{"$f":"C9/$C$10","v":0.10309332349845265},0,0,0]
[null,null,{"$f":"SUM(C5:C9)","v":1393679000},{"$f":"SUM(D5:D9)","v":1}]
[]
[]
[null,"General Reserve Fund Required Amount",{"$f":"INDEX('[12]Interco - Funding'!$30:$30,MATCH('Page 1'!E15,'[12]Interco - Funding'!$9:$9,0))","v":37500000},{"$f":"C13/C5","v":0.03}]
[]
[]
{"$rows_left_out":36}
{"sheet":"Page 8","index":7,"n_rows":62,"n_cols":9,"rows_kept":62,"cut":false,"hidden":false,"merged":[]}
[]
[null,"WATERFALLS"]
[]
[null,"MORTGAGES TRUSTEE REVENUE WATERFALL",null,null,"FUNDING 1 REVENUE WATERFALL",null,null,"ISSUER REVENUE WATERFALL"]
[null,{"$f":"\"* for collection period \"&TEXT(EOMONTH('Page 1'!E15,0)+1,\"DD MMMM YYYY\")&\" to \"&TEXT(EOMONTH('Page 1'!E15,0),\"DD MMMM YYYY\")","v":"* for collection period 01 April 2025 to 31 March 2025"}]
[null,"Mortgages Trustee Fees",{"$f":"'[12]Waterfall - Trustees'!$E$257","v":83.33},null,"Funding 1 Security Trustee fees",{"$f":"INDEX('[12]Waterfall - Funding'!$49:$49,MATCH(EOMONTH('Page 1'!E15,0),'[12]Waterfall - Funding'!$15:$15,0))","v":0},null,"Issuer Security Trustee fees",{"$f":"INDEX('[12]Waterfall - Issuer'!$239:$239,,MATCH('Page 1'!E15,'[12]Waterfall - Issuer'!$17:$17,0))","v":0}]
[null,"Other third party payments ",{"$f":"'[12]Waterfall - Trustees'!$E$258+'[12]Waterfall - Trustees'!$E$259","v":0},null,"Fee under Intercompany Loan",{"$f":"INDEX('[12]Waterfall - Funding'!$51:$51,MATCH(EOMONTH('Page 1'!E15,0),'[12]Waterfall - Funding'!$15:$15,0))","v":0},null,"Note Trustee fees",0]
[null,null,null,null,"Other third party payments",{"$f":"INDEX('[12]Waterfall - Funding'!$59:$59,MATCH(EOMONTH('Page 1'!E15,0),'[12]Waterfall - Funding'!$15:$15,0))","v":0},null,"Agent Bank fees etc.",0]
[null,null,null,null,"Profit to Funding 1 ",{"$f":"INDEX('[12]Waterfall - Funding'!$60:$60,MATCH(EOMONTH('Page 1'!E15,0),'[12]Waterfall - Funding'!$15:$15,0))","v":0},null,"Issuer profit ",{"$f":"INDEX('[12]Waterfall - Issuer'!$262:$262,MATCH('Page 1'!E15,'[12]Waterfall - Issuer'!$17:$17,0))","v":0}]
[null,"Servicer Fees",{"$f":"'[12]Waterfall - Trustees'!$E$261","v":85529.89}]
[null,"Cash Manager Fees",{"$f":"'[12]Waterfall - Trustees'!$E$262","v":0},null,"Cash Manager fees",{"$f":"INDEX('[12]Waterfall - Funding'!$54:$54,MATCH(EOMONTH('Page 1'!E15,0),'[12]Waterfall - Funding'!$15:$15,0))","v":0},null,"Other third party payments",{"$f":"INDEX('[12]Waterfall - Issuer'!$240:$240,MATCH('Page 1'!E15,'[12]Waterfall - Issuer'!$17:$17,0))","v":0}]
[null,"Mortgages Trustee Corporate Service Provider fees",{"$f":"'[12]Waterfall - Trustees'!$E$263","v":166.67},null,"Funding 1 Corporate Service Provider fees",{"$f":"INDEX('[12]Waterfall - Funding'!$65:$65,MATCH(EOMONTH('Page 1'!E15,0),'[12]Waterfall - Funding'!$15:$15,0))","v":0}]
[null,"Funding 1 Account Banks fees",{"$f":"'[12]Waterfall - Trustees'!$E$264","v":0},null,"Funding 1 Account Banks fees",0]
[null,null,null,null,null,null,null,"Issuer Cash Manager Fees",{"$f":"INDEX('[12]Waterfall - Issuer'!$242:$242,,MATCH('Page 1'!E15,'[12]Waterfall - Issuer'!$17:$17,0))","v":0}]
[null,null,null,null,"Payment to Funding 1 Swap Provider",{"$f":"INDEX('[12]Waterfall - Funding'!$71:$71,MATCH(EOMONTH('Page 1'!E15,0),'[12]Waterfall - Funding'!$15:$15,0))","v":0},null,"Issuer Corporate Service Provider Fees",{"$f":"INDEX('[12]Waterfall - Issuer'!$244:$244,,MATCH('Page 1'!E15,'[12]Waterfall - Issuer'!$17:$17,0))","v":0}]
{"$rows_left_out":48}
{"sheet":"Page 9","index":8,"n_rows":9,"n_cols":15,"rows_kept":9,"cut":false,"hidden":false,"merged":[]}
[]
[null,"SWAP PAYMENTS THIS PERIOD"]
[]
[null,"Note","Swap Provider","Currency Notional","Receive Reference Rate","Receive margin ","Receive Rate ","Interest Received","Principal Received","£ Notional","Pay reference rate","Pay margin ","Pay rate","Interest Paid","Principal Paid"]
[null,"Funding 1 Swap SONIA","SAN UK",{"$f":"INDEX('[12]Waterfall - Funding'!$259:$259,\nMATCH(EOMONTH('Page 1'!E15,0),'[12]Waterfall - Funding'!$15:$15,0))","v":0},"Compounded Daily SONIA",{"$f":"INDEX('[12]Waterfall - Funding'!$260:$260,MATCH(EOMONTH('Page 1'!E15,0),'[12]Waterfall - Funding'!$15:$15,0))","v":0},{"$f":"INDEX('[12]Waterfall - Funding'!$261:$261,\nMATCH(EOMONTH('Page 1'!E15,0),'[12]Waterfall - Funding'!$15:$15,0))","v":0},{"$f":"INDEX('[12]Waterfall - Funding'!$262:$262,\nMATCH(EOMONTH('Page 1'!E15,0),'[12]Waterfall - Funding'!$15:$15,0))","v":0},0,{"$f":"INDEX('[12]Waterfall - Funding'!$264:$264,\nMATCH(EOMONTH('Page 1'!E15,0),'[12]Waterfall - Funding'!$15:$15,0))","v":0},"N/A",0,{"$f":"+INDEX('[12]Waterfall - Funding'!$267:$267,\nMATCH(EOMONTH('Page 1'!E15,0),'[12]Waterfall - Funding'!$15:$15,0))","v":0},{"$f":"+INDEX('[12]Waterfall - Funding'!$268:$268,\nMATCH(EOMONTH('Page 1'!E15,0),'[12]Waterfall - Funding'!$15:$15,0))","v":0},0]
[]
[]
[]
[null,"Note","Collateral Postings","Counterparty"]

{"sheet":"Page 10","index":9,"n_rows":63,"n_cols":3,"rows_kept":63,"cut":false,"hidden":false,"merged":[[24,1,25,1]]}
[]
[]
[null,"TRIGGER EVENTS"]
[null,"Asset "]
[null,"   Amount debited to AAA Principal Deficiency Sub Ledger, unless certain criteria are met","None"]
[]
[null,"Non Asset "]
[null,"   Insolvency Event occurs in relation to Seller","None"]
[null,"   Sellers role as Servicer terminated & new Servicer is not appointed within 60 days","None"]
[null,"   The then current Seller Share is less than the adjusted Minimum Seller Share for 2 consecutive Trust Calculation Dates","None"]
[null,"   The aggregate outstanding principal balance of Loans in the Mortgages Trust is less than the required loan balance amount specified in the most recent"]
[null,"   final terms","None"]
[null,"An arrears trigger event will occur if:"]
[null,"   (i) the outstanding principal balance of the loans in arrears for more than 3 times the monthly payment then due divided by the outstanding principal "]
[null,"balance of all of the loans in the mortgages trust (expressed as a percentage) exceeds 2 per cent. or (ii) the issuer fails to exercise its option to redeem "]
{"$rows_left_out":48}